HACKINTOSH MONTRÉAL & FRANCE

[Résolu] Erreur lors du build dans opencore createur Capt1051
Vous devez lire la charte et vous présenter avant de poster!
➤  La Charte du Forum

➤  Présentation

Rejoignez le forum, c’est rapide et facile

HACKINTOSH MONTRÉAL & FRANCE

[Résolu] Erreur lors du build dans opencore createur Capt1051
Vous devez lire la charte et vous présenter avant de poster!
➤  La Charte du Forum

➤  Présentation
HACKINTOSH MONTRÉAL & FRANCE
Vous souhaitez réagir à ce message ? Créez un compte en quelques clics ou connectez-vous pour continuer.
Le Deal du moment : -62%
ABEIL – Lot de 2 Oreillers à ...
Voir le deal
14.54 €

[Résolu] Erreur lors du build dans opencore createur

4 participants

Page 1 sur 2 1, 2  Suivant

Aller en bas

[Résolu] Erreur lors du build dans opencore createur Empty [Résolu] Erreur lors du build dans opencore createur

Message par JMB Jeu 5 Jan - 10:50

Bonjour,

J'ai cette erreur quand je fais le choix 1 dans OC créateur :

Code:
build.py...
 : error 7000: Failed to execute command
   make tbuild [/Users/jean-martin/Github/OpenCorePkg/UDK/Build/OpenCorePkg/DEBUG_XCODE5/X64/MdePkg/Library/BaseLib/BaseLib]


build.py...
 : error F002: Failed to build module
   /Users/jean-martin/Github/OpenCorePkg/UDK/MdePkg/Library/BaseLib/BaseLib.inf [X64, XCODE5, DEBUG]

- Failed -
Build end time: 17:53:01, Jan.05 2023
Build total time: 00:00:12

./build_oc.tool: line 344: 28588 Terminated: 15          pingme $! build "$@"
=======================================
Build OpenCore Done!  
=======================================


Mon SIP est désactivé et ke gatekeeper aussi.


Dernière édition par JMB le Dim 8 Jan - 5:53, édité 3 fois
JMB
JMB
Super usr
Super usr

Date d'inscription : 27/05/2015
Age : 57

http://latavernedupangolin.eu

Revenir en haut Aller en bas

[Résolu] Erreur lors du build dans opencore createur Empty Re: [Résolu] Erreur lors du build dans opencore createur

Message par JMB Jeu 5 Jan - 10:53

Désolé erreur, doublon...
JMB
JMB
Super usr
Super usr

Date d'inscription : 27/05/2015
Age : 57

http://latavernedupangolin.eu

Revenir en haut Aller en bas

[Résolu] Erreur lors du build dans opencore createur Empty Re: [Résolu] Erreur lors du build dans opencore createur

Message par chris1111 Jeu 5 Jan - 14:02

Est ce que Xcode et les CommandLine tools sont bien installer?

Xcode configurer comme ceci


[Résolu] Erreur lors du build dans opencore createur Capt1265
chris1111
chris1111
Admin
Admin

Date d'inscription : 18/12/2012
Localisation : Laval. Québec Canada

https://www.hackintosh-montreal.com

Revenir en haut Aller en bas

[Résolu] Erreur lors du build dans opencore createur Empty Re: [Résolu] Erreur lors du build dans opencore createur

Message par JMB Jeu 5 Jan - 15:35

Oui c'est bien configuré comme ça. Et j'ai bien les command line tools installés :

Code:
jean-martin@iMac ~ % xcode-select --install
xcode-select: error: command line tools are already installed, use "Software Update" to install updates
jean-martin@iMac ~ %

Ca ne pourrait pas être un problème de version de python ?
JMB
JMB
Super usr
Super usr

Date d'inscription : 27/05/2015
Age : 57

http://latavernedupangolin.eu

Revenir en haut Aller en bas

[Résolu] Erreur lors du build dans opencore createur Empty Re: [Résolu] Erreur lors du build dans opencore createur

Message par chris1111 Jeu 5 Jan - 15:37

JMB a écrit:Oui c'est bien configuré comme ça. Et j'ai bien les command line tools installés :

Code:
jean-martin@iMac ~ % xcode-select --install
xcode-select: error: command line tools are already installed, use "Software Update" to install updates
jean-martin@iMac ~ %

Ca ne pourrait pas être un problème de version de python ?


Command lIne tools faut les Installer ausssi

Fait
gcc
chris1111
chris1111
Admin
Admin

Date d'inscription : 18/12/2012
Localisation : Laval. Québec Canada

https://www.hackintosh-montreal.com

Revenir en haut Aller en bas

[Résolu] Erreur lors du build dans opencore createur Empty Re: [Résolu] Erreur lors du build dans opencore createur

Message par JMB Jeu 5 Jan - 15:41

Oui mais justement le retour du terminal indique que les commad line tools sont installés.

Code:
jean-martin@iMac ~ % gcc
clang: error: no input files
jean-martin@iMac ~ %
JMB
JMB
Super usr
Super usr

Date d'inscription : 27/05/2015
Age : 57

http://latavernedupangolin.eu

Revenir en haut Aller en bas

[Résolu] Erreur lors du build dans opencore createur Empty Re: [Résolu] Erreur lors du build dans opencore createur

Message par chris1111 Jeu 5 Jan - 16:10

Vas sur le Disque
Bibliotheque/Developer/
Tu devrait voir CommandLineTools
chris1111
chris1111
Admin
Admin

Date d'inscription : 18/12/2012
Localisation : Laval. Québec Canada

https://www.hackintosh-montreal.com

Revenir en haut Aller en bas

[Résolu] Erreur lors du build dans opencore createur Empty Re: [Résolu] Erreur lors du build dans opencore createur

Message par arcade33 Jeu 5 Jan - 23:41

chris1111 a écrit:Vas sur le Disque
Bibliotheque/Developer/
Tu devrait voir CommandLineTools
[Résolu] Erreur lors du build dans opencore createur Capt1457

si tu l'as pas fait : xcode-select --install

_________________
mes configs:

si nous vous avons aidé faites des TUTOS de vos installations
merci d'avance
je ne réponds plus à ceux qui ne se sont pas présentés et mis matériel dans leurs profils
arcade33
arcade33
Souverain
Souverain

Date d'inscription : 27/10/2013
Age : 67
Localisation : LANGON 33 - FRANCE

Revenir en haut Aller en bas

[Résolu] Erreur lors du build dans opencore createur Empty Re: [Résolu] Erreur lors du build dans opencore createur

Message par JMB Ven 6 Jan - 5:20

chris1111 a écrit:Vas sur le Disque
Bibliotheque/Developer/
Tu devrait voir CommandLineTools

Oui jai bien cela sur mon DD :

[Résolu] Erreur lors du build dans opencore createur Captur36

Et j'ai bien installé les command line tools puisque si je relance la commande j'obtiens ça :

Code:
jean-martin@iMac ~ % xcode-select --install
xcode-select: error: command line tools are already installed, use "Software Update" to install updates
jean-martin@iMac ~ %


Par contre je n'ai rien concernant ma version de Monterey, la 12.6 dans le dossier SDKs de Command Line Tools :

[Résolu] Erreur lors du build dans opencore createur Captur38
JMB
JMB
Super usr
Super usr

Date d'inscription : 27/05/2015
Age : 57

http://latavernedupangolin.eu

Revenir en haut Aller en bas

[Résolu] Erreur lors du build dans opencore createur Empty Re: [Résolu] Erreur lors du build dans opencore createur

Message par arcade33 Ven 6 Jan - 5:25

t'es bien sous VENTURA
et tu as lancé une fois Xcode

_________________
mes configs:

si nous vous avons aidé faites des TUTOS de vos installations
merci d'avance
je ne réponds plus à ceux qui ne se sont pas présentés et mis matériel dans leurs profils
arcade33
arcade33
Souverain
Souverain

Date d'inscription : 27/10/2013
Age : 67
Localisation : LANGON 33 - FRANCE

Revenir en haut Aller en bas

[Résolu] Erreur lors du build dans opencore createur Empty Re: [Résolu] Erreur lors du build dans opencore createur

Message par JMB Ven 6 Jan - 5:27

Non, je suis sue Monterey 12.6 et j'ai bien lancé une fois (même plus) Xcode. Pas encore fait la maj Ventura.
JMB
JMB
Super usr
Super usr

Date d'inscription : 27/05/2015
Age : 57

http://latavernedupangolin.eu

Revenir en haut Aller en bas

[Résolu] Erreur lors du build dans opencore createur Empty Re: [Résolu] Erreur lors du build dans opencore createur

Message par djams Ven 6 Jan - 5:50

JMB a écrit:Non, je suis sue Monterey 12.6 et j'ai bien lancé une fois (même plus) Xcode. Pas encore fait la maj Ventura.

essayer ceci .

[Résolu] Erreur lors du build dans opencore createur Capt1836

[Résolu] Erreur lors du build dans opencore createur Capt1837

[Résolu] Erreur lors du build dans opencore createur Capt1838
djams
djams
Testeur Hackintosh
Testeur Hackintosh

Date d'inscription : 22/07/2019
Age : 54
Localisation : Champagne Ardenne (51)

Revenir en haut Aller en bas

[Résolu] Erreur lors du build dans opencore createur Empty Re: [Résolu] Erreur lors du build dans opencore createur

Message par JMB Ven 6 Jan - 8:20

J'ai fait ça, il y a bien eu des maj de xcode et de sécurité pour Monterey (12.6.2 maintenant), mais j'ai la même erreur.

Code:
build.py...
 : error 7000: Failed to execute command
   make tbuild [/Users/jean-martin/Github/OpenCorePkg/UDK/Build/OpenCorePkg/DEBUG_XCODE5/X64/MdePkg/Library/BaseLib/BaseLib]


build.py...
 : error F002: Failed to build module
   /Users/jean-martin/Github/OpenCorePkg/UDK/MdePkg/Library/BaseLib/BaseLib.inf [X64, XCODE5, DEBUG]

- Failed -
Build end time: 15:18:01, Jan.06 2023
Build total time: 00:00:14

./build_oc.tool: line 344: 15121 Terminated: 15          pingme $! build "$@"
=======================================
Build OpenCore Done! 
=======================================
JMB
JMB
Super usr
Super usr

Date d'inscription : 27/05/2015
Age : 57

http://latavernedupangolin.eu

Revenir en haut Aller en bas

[Résolu] Erreur lors du build dans opencore createur Empty Re: [Résolu] Erreur lors du build dans opencore createur

Message par chris1111 Ven 6 Jan - 8:30

Bizarre ton truc je vient de le faire
Le pire cest que je nai aucun Python dinstaller sur un Ventura fraichement installer
OC Createur utilise le Defaut Python macOS sant probleme ha26
[Résolu] Erreur lors du build dans opencore createur Scree708
chris1111
chris1111
Admin
Admin

Date d'inscription : 18/12/2012
Localisation : Laval. Québec Canada

https://www.hackintosh-montreal.com

djams aime ce message

Revenir en haut Aller en bas

[Résolu] Erreur lors du build dans opencore createur Empty Re: [Résolu] Erreur lors du build dans opencore createur

Message par JMB Ven 6 Jan - 11:12

Si je teste la version de python ça donne ça, c'est normal ?

Code:
jean-martin@iMac ~ % python --version && which python
Python 2.7.18
/usr/local/bin/python
jean-martin@iMac ~ % python3 --version && which python3
Python 3.10.4
/usr/local/bin/python3
jean-martin@iMac ~ %

Alors qu'il semble que je devrais avoir :

Code:
python --version && which python
Python 2.7.18
/usr/bin/python

python3 --version && which python3
Python 3.8.9
/usr/bin/python3

[/code]
JMB
JMB
Super usr
Super usr

Date d'inscription : 27/05/2015
Age : 57

http://latavernedupangolin.eu

Revenir en haut Aller en bas

[Résolu] Erreur lors du build dans opencore createur Empty Re: [Résolu] Erreur lors du build dans opencore createur

Message par chris1111 Ven 6 Jan - 11:37

Si tu a installer python3 il te faut Update le profile et Install Certificat

[Résolu] Erreur lors du build dans opencore createur Scree709
chris1111
chris1111
Admin
Admin

Date d'inscription : 18/12/2012
Localisation : Laval. Québec Canada

https://www.hackintosh-montreal.com

Revenir en haut Aller en bas

[Résolu] Erreur lors du build dans opencore createur Empty Re: [Résolu] Erreur lors du build dans opencore createur

Message par JMB Sam 7 Jan - 7:28

J'ai fait tout ça, ça plante toujours, j'ai viré les installs de python, maintenant j'ai bien :

Code:
jean-martin@iMac ~ % python3 --version && which python3
Python 3.9.6
/usr/bin/python3
jean-martin@iMac ~ %


J'ai pris la toute dernière version de opencore créateur qui vient d'être postée mais :

Code:
Building ... /Users/jean-martin/Github/OpenCorePkg/UDK/OpenCorePkg/Library/OcAppleImageConversionLib/OcAppleImageConversionLib.inf [X64]
/Users/jean-martin/Github/OpenCorePkg/UDK/Build/OpenCorePkg/DEBUG_XCODE5/X64/MdePkg/Library/BaseLib/BaseLib/OUTPUT/X64/LongJump.iii:44: error: parser: instruction expected
/Users/jean-martin/Github/OpenCorePkg/UDK/Build/OpenCorePkg/DEBUG_XCODE5/X64/MdePkg/Library/BaseLib/BaseLib/OUTPUT/X64/LongJump.iii:49: error: parser: instruction expected
make: *** [/Users/jean-martin/Github/OpenCorePkg/UDK/Build/OpenCorePkg/DEBUG_XCODE5/X64/MdePkg/Library/BaseLib/BaseLib/OUTPUT/X64/LongJump.obj] Error 1


build.py...
 : error 7000: Failed to execute command
   make tbuild [/Users/jean-martin/Github/OpenCorePkg/UDK/Build/OpenCorePkg/DEBUG_XCODE5/X64/MdePkg/Library/BaseLib/BaseLib]


build.py...
 : error F002: Failed to build module
   /Users/jean-martin/Github/OpenCorePkg/UDK/MdePkg/Library/BaseLib/BaseLib.inf [X64, XCODE5, DEBUG]

- Failed -
Build end time: 14:25:24, Jan.07 2023
Build total time: 00:00:13

./build_oc.tool: line 344: 13758 Terminated: 15          pingme $! build "$@"
=======================================
Build OpenCore Done! 
=======================================
JMB
JMB
Super usr
Super usr

Date d'inscription : 27/05/2015
Age : 57

http://latavernedupangolin.eu

Revenir en haut Aller en bas

[Résolu] Erreur lors du build dans opencore createur Empty Re: [Résolu] Erreur lors du build dans opencore createur

Message par djams Sam 7 Jan - 7:52

JMB a écrit:J'ai fait tout ça, ça plante toujours, j'ai viré les installs de python, maintenant j'ai bien :

Code:
jean-martin@iMac ~ % python3 --version && which python3
Python 3.9.6
/usr/bin/python3
jean-martin@iMac ~ %


J'ai pris la toute dernière version de opencore créateur qui vient d'être postée mais :

Code:
Building ... /Users/jean-martin/Github/OpenCorePkg/UDK/OpenCorePkg/Library/OcAppleImageConversionLib/OcAppleImageConversionLib.inf [X64]
/Users/jean-martin/Github/OpenCorePkg/UDK/Build/OpenCorePkg/DEBUG_XCODE5/X64/MdePkg/Library/BaseLib/BaseLib/OUTPUT/X64/LongJump.iii:44: error: parser: instruction expected
/Users/jean-martin/Github/OpenCorePkg/UDK/Build/OpenCorePkg/DEBUG_XCODE5/X64/MdePkg/Library/BaseLib/BaseLib/OUTPUT/X64/LongJump.iii:49: error: parser: instruction expected
make: *** [/Users/jean-martin/Github/OpenCorePkg/UDK/Build/OpenCorePkg/DEBUG_XCODE5/X64/MdePkg/Library/BaseLib/BaseLib/OUTPUT/X64/LongJump.obj] Error 1


build.py...
 : error 7000: Failed to execute command
   make tbuild [/Users/jean-martin/Github/OpenCorePkg/UDK/Build/OpenCorePkg/DEBUG_XCODE5/X64/MdePkg/Library/BaseLib/BaseLib]


build.py...
 : error F002: Failed to build module
   /Users/jean-martin/Github/OpenCorePkg/UDK/MdePkg/Library/BaseLib/BaseLib.inf [X64, XCODE5, DEBUG]

- Failed -
Build end time: 14:25:24, Jan.07 2023
Build total time: 00:00:13

./build_oc.tool: line 344: 13758 Terminated: 15          pingme $! build "$@"
=======================================
Build OpenCore Done!  
=======================================

Bonjour

Fait avec une installation de Monterey  

Aucun soucis

[Résolu] Erreur lors du build dans opencore createur Capt1844
djams
djams
Testeur Hackintosh
Testeur Hackintosh

Date d'inscription : 22/07/2019
Age : 54
Localisation : Champagne Ardenne (51)

Revenir en haut Aller en bas

[Résolu] Erreur lors du build dans opencore createur Empty Re: [Résolu] Erreur lors du build dans opencore createur

Message par JMB Sam 7 Jan - 7:57

Ben oui mais de mon côté ça coince... C'est dommage je ne peux pas uploader le retour du terminal. J'ai eu des erreurs à propos de "mtoc" qui ne serait pas valide. Pourtant quand je le cherche, il existe :

Code:
Found incompatible mtoc installed to /usr/local/bin/mtoc!
Expected SHA-256: 81b48105cabfef6e85da5aab7fb61b9c6a2219ca809dc09f98df362f6db2c893
Found SHA-256:    fea8594c50afbdb5d259f147e6d72a08fc0baef69c5a12ea001d11d12139c354
Hint: Reinstall this mtoc or use IGNORE_MTOC_VERSION=1 at your own risk.
Missing or incompatible mtoc!
To build mtoc follow: https://github.com/tianocore/tianocore.github.io/wiki/Xcode#mac-os-x-xcode
Install prebuilt mtoc automatically?
Enter [Y]es to continue:

Code:
jean-martin@iMac ~ % which mtoc
/usr/local/bin/mtoc
jean-martin@iMac ~ %

J'ai vu sur cette page https://github.com/tianocore/tianocore.github.io/wiki/Xcode#mac-os-x-xcode qu'on peut l'installer via brew mais ça ne marche pas non plus. J'ai donc viré la version de brew. Est-ce normal que mtoc soit situé dans /usr/local/bin/ ?

Je ne comprends parce que je compile pas mal de logiciels sur cette machine et je n'ai pas de soucis. Et je ne sais pas comment compiler les sources de OC dans Xcode...
JMB
JMB
Super usr
Super usr

Date d'inscription : 27/05/2015
Age : 57

http://latavernedupangolin.eu

Revenir en haut Aller en bas

[Résolu] Erreur lors du build dans opencore createur Empty Re: [Résolu] Erreur lors du build dans opencore createur

Message par djams Sam 7 Jan - 8:27

JMB a écrit:Ben oui mais de mon côté ça coince... C'est dommage je ne peux pas uploader le retour du terminal. J'ai eu des erreurs à propos de "mtoc" qui ne serait pas valide. Pourtant quand je le cherche, il existe :

Code:
Found incompatible mtoc installed to /usr/local/bin/mtoc!
Expected SHA-256: 81b48105cabfef6e85da5aab7fb61b9c6a2219ca809dc09f98df362f6db2c893
Found SHA-256:    fea8594c50afbdb5d259f147e6d72a08fc0baef69c5a12ea001d11d12139c354
Hint: Reinstall this mtoc or use IGNORE_MTOC_VERSION=1 at your own risk.
Missing or incompatible mtoc!
To build mtoc follow: https://github.com/tianocore/tianocore.github.io/wiki/Xcode#mac-os-x-xcode
Install prebuilt mtoc automatically?
Enter [Y]es to continue:

Code:
jean-martin@iMac ~ % which mtoc
/usr/local/bin/mtoc
jean-martin@iMac ~ %

J'ai vu sur cette page https://github.com/tianocore/tianocore.github.io/wiki/Xcode#mac-os-x-xcode qu'on peut l'installer via brew mais ça ne marche pas non plus. J'ai donc viré la version de brew. Est-ce normal que mtoc soit situé dans /usr/local/bin/ ?

Je ne comprends parce que je compile pas mal de logiciels sur cette machine et je n'ai pas de soucis. Et je ne sais pas comment compiler les sources de OC dans Xcode...

Vous utiliser Xcode 14.1 dans Monterey ??
djams
djams
Testeur Hackintosh
Testeur Hackintosh

Date d'inscription : 22/07/2019
Age : 54
Localisation : Champagne Ardenne (51)

chris1111 aime ce message

Revenir en haut Aller en bas

[Résolu] Erreur lors du build dans opencore createur Empty Re: [Résolu] Erreur lors du build dans opencore createur

Message par JMB Sam 7 Jan - 8:28

J'utilise la version que les maj proposent... Ce n'est pas la bonne ?
JMB
JMB
Super usr
Super usr

Date d'inscription : 27/05/2015
Age : 57

http://latavernedupangolin.eu

Revenir en haut Aller en bas

[Résolu] Erreur lors du build dans opencore createur Empty Re: [Résolu] Erreur lors du build dans opencore createur

Message par chris1111 Sam 7 Jan - 8:30

cest surement du A la vesion XCODE ?
chris1111
chris1111
Admin
Admin

Date d'inscription : 18/12/2012
Localisation : Laval. Québec Canada

https://www.hackintosh-montreal.com

Revenir en haut Aller en bas

[Résolu] Erreur lors du build dans opencore createur Empty Re: [Résolu] Erreur lors du build dans opencore createur

Message par djams Sam 7 Jan - 8:32

JMB a écrit:J'utilise la version que les maj proposent... Ce n'est pas la bonne ?

perso dans Monterey j'utilise la 14.1 mais d'autre sont également prise en charge suivant ce que l'on fait,  a cela installer la bonne version de command line .

[Résolu] Erreur lors du build dans opencore createur Capt1845

Et pour exemple dans Ventura j'utilise cette version , et tout va très bien .

[Résolu] Erreur lors du build dans opencore createur Capt1846
djams
djams
Testeur Hackintosh
Testeur Hackintosh

Date d'inscription : 22/07/2019
Age : 54
Localisation : Champagne Ardenne (51)

Revenir en haut Aller en bas

[Résolu] Erreur lors du build dans opencore createur Empty Re: [Résolu] Erreur lors du build dans opencore createur

Message par JMB Sam 7 Jan - 9:16

Ce n'est tout de même pas très clair, sur ce tableau pas de référence à Monterey 12.6, ça s'arrête à 12.3, après c'est 13... J'ai viré la 14.2 et je download les 14.2 et 14.0.1... On verra.
JMB
JMB
Super usr
Super usr

Date d'inscription : 27/05/2015
Age : 57

http://latavernedupangolin.eu

chris1111 aime ce message

Revenir en haut Aller en bas

[Résolu] Erreur lors du build dans opencore createur Empty Re: [Résolu] Erreur lors du build dans opencore createur

Message par djams Dim 8 Jan - 1:35

JMB a écrit:Ce n'est tout de même pas très clair, sur ce tableau pas de référence à Monterey 12.6, ça s'arrête à 12.3, après c'est 13... J'ai viré la 14.2 et je download les 14.2 et 14.0.1... On verra.

Bonjour

ici c'est  extrêmement claire , il y a toutes les versions bien indiquer plus les notes a consulter qui vont avec  chaque versions , impossible de se tromper .  lunette  Rirenard

Xcode .XXXXX:
djams
djams
Testeur Hackintosh
Testeur Hackintosh

Date d'inscription : 22/07/2019
Age : 54
Localisation : Champagne Ardenne (51)

Revenir en haut Aller en bas

[Résolu] Erreur lors du build dans opencore createur Empty Re: [Résolu] Erreur lors du build dans opencore createur

Message par Contenu sponsorisé


Contenu sponsorisé


Revenir en haut Aller en bas

Page 1 sur 2 1, 2  Suivant

Revenir en haut

- Sujets similaires

 
Permission de ce forum:
Vous ne pouvez pas répondre aux sujets dans ce forum